BDBM50317659 4-[3-(4-Cyano-3-trifluoromethylphenyl)-5,5-dimethyl-4-oxo-2-thioxoimidazolidin-1-yl]butane-1-sulfonamide::CHEMBL1098171
SMILES CC1(C)N(CCCCS(N)(=O)=O)C(=S)N(C1=O)c1ccc(C#N)c(c1)C(F)(F)F
InChI Key InChIKey=CKUVUKJYCLTZAY-UHFFFAOYSA-N
Data  3 IC50
  Tab Delimited (TSV)   2D SDfile   Computed 3D by Vconf -m prep SDfile
Find this compound or compounds like it in BindingDB:
Activity Spreadsheet -- Enzyme Inhibition Constant Data from BindingDB
Found 3 hits for monomerid = 50317659
TargetAndrogen receptor(Homo sapiens (Human))
Chugai Pharmaceutical
Curated by ChEMBL
LigandPNGBDBM50317659(4-[3-(4-Cyano-3-trifluoromethylphenyl)-5,5-dimethy...)
Affinity DataIC50:  110nM. Assay description: Antagonist activity at AR in bicalutamide-resistant human LNCAP cells assessed as effect on cell proliferation after 6 days
In DepthDetails ArticlePubMed
TargetAndrogen receptor(Homo sapiens (Human))
Chugai Pharmaceutical
Curated by ChEMBL
LigandPNGBDBM50317659(4-[3-(4-Cyano-3-trifluoromethylphenyl)-5,5-dimethy...)
Affinity DataIC50: >1.00E+3nM. Assay description: Displacement of [3H]mibolerone from human AR expressed in CHO-K1 cells after 2 hrs by scintillation counting
In DepthDetails ArticlePubMed
TargetAndrogen receptor(Homo sapiens (Human))
Chugai Pharmaceutical
Curated by ChEMBL
LigandPNGBDBM50317659(4-[3-(4-Cyano-3-trifluoromethylphenyl)-5,5-dimethy...)
Affinity DataIC50:  1.40E+3nM. Assay description: Antagonist activity at AR in human LNCAP cells assessed as effect on cell proliferation after 6 days
In DepthDetails ArticlePubMed